Stedsnavn for vanlig bruk
type: Concept
in scheme: http://skjema.geonorge.no/SOSI/produktspesifikasjon/StedsnavnForVanligBruk/20181115
definition: spesifikasjonen omfatter de vanlig brukte stedsnavn som inngår i Sentralt stedsnavnregister - SSR2