Navneobjekttype
type: ConceptScheme
definition: Detaljert klassifisering av hvilke type fenomen stedsnavnet står til.

Administrativ bydel
type: Concept
in scheme: Navneobjekttype
definition: Offisielt navn på bydelsforvaltningen i et angitt område.
broader: administrativeIndelinger

Adressenavn
type: Concept
in scheme: Navneobjekttype
definition: Offisielt adressenavn, veg-/gatenavn eller områdenavn, jf. § 2 bokstav e i matrikkelforskriften.
broader: veg

Adressetilleggsnavn
type: Concept
in scheme: Navneobjekttype
definition: Et stedsnavn som er en del av den offisielle (veg-)adressen, jf. § 54 i matrikkelforskriften; vanligvis bruksnavn eller sjeldnere bygnings-/institusjonsnavn.
broader: veg

Allmenning
type: Concept
in scheme: Navneobjekttype
definition: Område hvor rettighetene er regulert og fordelt på flere.
broader: verne-OgBruksområder

Alpinanlegg
type: Concept
in scheme: Navneobjekttype
definition: Anlegg for slalåm, utfor, snøbrett osv.
broader: fritidsanlegg

Ankringsplass
type: Concept
in scheme: Navneobjekttype
definition: Opplagsplass for store fartøy.
broader: sjøfart

Annen administrativ inndeling
type: Concept
in scheme: Navneobjekttype
definition: Andre administrative inndelinger som ikke tilhører øvrige navneobjekttyper.
broader: administrativeIndelinger

Annen bygning for religionsutøvelse
type: Concept
in scheme: Navneobjekttype
definition: Synagoge, moské, frikirke, menighetshus, kloster, gravkapell, bårehus, krematorium.
broader: kulturinstitusjoner

Annen industri- og lagerbygning
type: Concept
in scheme: Navneobjekttype
definition: Mindre industri- og produksjonsbedrift eller lager.
broader: næring

Annen kulturdetalj
type: Concept
in scheme: Navneobjekttype
definition: Alle andre typer kulturdetaljer, f.eks. lekeplass, utkikkstårn, fiskeplass, og lignende.
broader: kulturminner

Annen terrengdetalj
type: Concept
in scheme: Navneobjekttype
definition: Små detaljer som ikke dekkes av andre navneobjekttyper innenfor kategorien.
broader: terrengdetaljer

Annen vanndetalj
type: Concept
in scheme: Navneobjekttype
definition: Andre navngitte forhold i ferskvann.
broader: detaljerIFerskvann

Badeplass
type: Concept
in scheme: Navneobjekttype
definition: Offentlig eller privat badeplass.
broader: fritidsanlegg

Bakke
type: Concept
in scheme: Navneobjekttype
definition: Terrengskråning, særlig om siden av en ås eller haug.
broader: skråninger

Bakke (Veg)
type: Concept
in scheme: Navneobjekttype
definition: Allment kjent bakke på alle typer veger og gater.
broader: veg

Bakke i sjø
type: Concept
in scheme: Navneobjekttype
definition: Skrånende sjøbunn.
broader: sjøbunn

Bakketopp i sjø
type: Concept
in scheme: Navneobjekttype
definition: Undersjøisk knaus, kolle eller haug.
broader: sjøbunn

Banestrekning
type: Concept
in scheme: Navneobjekttype
definition: Jernbanestrekning, tunnelbane eller trikkelinje/-strekning.
broader: bane

Banke
type: Concept
in scheme: Navneobjekttype
definition: Flatt, større undervannsområde.
broader: grunnerIFerskvann

Banke i sjø
type: Concept
in scheme: Navneobjekttype
definition: Større grunt område i sjøen med dypere vann omkring; fiskegrunn.
broader: sjøbunn

Barnehage
type: Concept
in scheme: Navneobjekttype
definition: Offentlig og privat barnehage.
broader: institusjoner

Basseng i sjø
type: Concept
in scheme: Navneobjekttype
definition: Vid, undersjøisk dal.
broader: sjøbunn

Bekk
type: Concept
in scheme: Navneobjekttype
definition: Rennende vann i naturlig vannvei, vanligvis smalere enn 3 meter.
broader: rennendeVann

Berg
type: Concept
in scheme: Navneobjekttype
definition: Markert eller avrunda høyde med stein, steinmasse (med eller uten vegetasjon).
broader: høyder

Bergverk
type: Concept
in scheme: Navneobjekttype
definition: Gruve, skjerp og mineraluttak i dagen eller under jorda.
broader: uttakOgDeponi

Boligblokk
type: Concept
in scheme: Navneobjekttype
definition: Stort (bolig)hus av mur, betong med over fire boliger som har felles trapp(er) eller heis(er).
broader: bolighus

Boligfelt
type: Concept
in scheme: Navneobjekttype
definition: Regulert boligområde.
broader: bebyggelsesområder

Bomstasjon
type: Concept
in scheme: Navneobjekttype
definition: Større bomanlegg på offentlig veg.
broader: samferdselsanlegg

Borettslag
type: Concept
in scheme: Navneobjekttype
definition: Bofellesskap i blokk eller flerbebyggelse.
broader: bolighus

Botn
type: Concept
in scheme: Navneobjekttype
definition: Innerste del av en dal; rundaktig, bratt dal eller uthulning i fjellet.
broader: senkninger

Bru
type: Concept
in scheme: Navneobjekttype
definition: Både på veg og jernbane.
broader: samferdselsanlegg

Bruk
type: Concept
in scheme: Navneobjekttype
definition: Navn på (landbruks)eiendom med ett eller flere bruksnummer under ett gardsnummer, jf. lov om stadnamn §§ 2 og 8.
broader: gardsbebyggelse

Brygge
type: Concept
in scheme: Navneobjekttype
definition: Mindre, fastbygd bryggeanlegg.
broader: sjøfart

Busstopp
type: Concept
in scheme: Navneobjekttype
definition: Stoppested for rutegående vegtrafikk.
broader: veg

By
type: Concept
in scheme: Navneobjekttype
definition: Tettbygd sted som er større og (til dels) innehar viktigere funksjoner enn andre tettbygde steder / tettsteder.
broader: bebyggelsesområder

Bydel
type: Concept
in scheme: Navneobjekttype
definition: Kulturmessig del av by.
broader: bebyggelsesområder

Bygdelag (bygd)
type: Concept
in scheme: Navneobjekttype
definition: Stort, uregulert gards- og boligområde.
broader: bebyggelsesområder

Bygg for jordbruk, fiske og fangst
type: Concept
in scheme: Navneobjekttype
definition: Til primærnæring, f.eks. naust, uthus, sommerfjøs eller gamme.
broader: gardsbebyggelse

Båe
type: Concept
in scheme: Navneobjekttype
definition: Fjell eller stein under vannflaten.
broader: grunnerIFerskvann

Båe i sjø
type: Concept
in scheme: Navneobjekttype
definition: Spiss grunne; blindskjær som sjøen bryter over.
broader: grunnerISjø

Båke
type: Concept
in scheme: Navneobjekttype
definition: Fast sjømerke. Sprinkelverk bygget i tre eller metall.
broader: navigasjon

Campingplass
type: Concept
in scheme: Navneobjekttype
definition: Alle typer, med/uten campinghytter, campingvogner og telt.
broader: næring

Dal
type: Concept
in scheme: Navneobjekttype
definition: Mellomstor eller liten dal.
broader: senkninger

Dalføre
type: Concept
in scheme: Navneobjekttype
definition: Stor dal med sidedaler.
broader: senkninger

Dam
type: Concept
in scheme: Navneobjekttype
definition: Både store reguleringsdammer og små fløtningsdammer. Angi kurve for lange og ett punkt midt på for korte damkroner.
broader: stilleståendeVann

Del av innsjø
type: Concept
in scheme: Navneobjekttype
definition: Mindre del av innsjø.
broader: stilleståendeVann

Egg i sjø
type: Concept
in scheme: Navneobjekttype
definition: Undersjøisk kant mot havdyp.
broader: sjøbunn

Eid
type: Concept
in scheme: Navneobjekttype
definition: Lavt eller smalt parti mellom to vannkanter (elv eller vann).
broader: ferskvannskontur

Eid i sjø
type: Concept
in scheme: Navneobjekttype
definition: Landstripe med sjø på begge sider som binder sammen to landområder.
broader: kystkontur

Eiendom
type: Concept
in scheme: Navneobjekttype
definition: Navn på eiendomer som ikke er bruksnavn, ev. felles stedsnavn for flere eiendommer.
broader: gardsbebyggelse

Elv
type: Concept
in scheme: Navneobjekttype
definition: Rennende vann i naturlig vannvei, vanligvis bredere enn 3 meter.
broader: rennendeVann

Elvemel
type: Concept
in scheme: Navneobjekttype
definition: Bratt sand-/grusskråning langs elv eller vann.
broader: løsmasseavsetninger

Elvesving
type: Concept
in scheme: Navneobjekttype
definition: Naturlig sving i elv eller bekk.
broader: rennendeVann

Enebolig/mindre boligbygg
type: Concept
in scheme: Navneobjekttype
definition: Navn på mindre eiendom for fast bosetting. Hovedsakelig eiendom hvor eier kan bestemme skrivemåten (jf. § 8 i lov om stadnamn og § 54 i matrikkelforskriften). Kan også omfatte eget navn på bygg, eller våningshus/gardsbruk som ikke er gitt eget matrikkelnummer.
broader: bolighus

Eng
type: Concept
in scheme: Navneobjekttype
definition: Kultivert slåtte-/gressmark.
broader: dyrkamark

Fabrikk
type: Concept
in scheme: Navneobjekttype
definition: Større industrivirksomhet.
broader: næring

Farled/skipslei
type: Concept
in scheme: Navneobjekttype
definition: Allment kjent seglingslei/farvannsområde med dybdeforhold passende for skip av en viss størrelse.
broader: sjøfart

Fengsel
type: Concept
in scheme: Navneobjekttype
definition: Bygning der arresterte eller dømte personer soner straff.
broader: institusjoner

Ferjekai
type: Concept
in scheme: Navneobjekttype
definition: Ferjekai i fast regulert ferjesamband.
broader: sjøfart

Ferjestrekning
type: Concept
in scheme: Navneobjekttype
definition: Ferjesamband som inngår i områdets samferdselsnett.
broader: sjøfart

Fiskeplass i sjø
type: Concept
in scheme: Navneobjekttype
definition: Navngitt fiskested; fiskemed.
broader: farvann

Fjell
type: Concept
in scheme: Navneobjekttype
definition: Høyereliggende område (over tregrensa) med stein og sva og lite vegetasjon som reiser seg over landskapet omkring (med høye berg og nuter).
broader: høyder

Fjell i dagen
type: Concept
in scheme: Navneobjekttype
definition: Lite/ingen vegetasjon; sva, svaberg. Erstattes av sva.
broader: bartFjell

Fjellheis
type: Concept
in scheme: Navneobjekttype
definition: Gondolbane og trallebane for frakt av folk.
broader: samferdselsanlegg

Fjellkant
type: Concept
in scheme: Navneobjekttype
definition: Aksel, skulder, nese og bryn.
broader: høyder

Fjellkjede i sjø
type: Concept
in scheme: Navneobjekttype
definition: Lengre, sammenhengende undersjøisk fjellformasjon.
broader: sjøbunn

Fjellområde
type: Concept
in scheme: Navneobjekttype
definition: Større område med fjell og fjellandskap.
broader: terrengområder

Fjellside
type: Concept
in scheme: Navneobjekttype
definition: Åpent, skrånende terreng i fjellet.
broader: skråninger

Fjelltopp i sjø
type: Concept
in scheme: Navneobjekttype
definition: Undersjøisk fjelltopp.
broader: sjøbunn

Fjord
type: Concept
in scheme: Navneobjekttype
definition: Arm av havet inn i fastlandet.
broader: farvann

Fjordmunning
type: Concept
in scheme: Navneobjekttype
definition: Område ytterst i en fjord.
broader: farvann

Flyplass
type: Concept
in scheme: Navneobjekttype
definition: Offentlig godkjent, avgrenset område med start- og landingsplass for fly.
broader: luftfart

Fløtningsanlegg
type: Concept
in scheme: Navneobjekttype
definition: Kunstig fløtningsanlegg.
broader: rennendeVann

Fonn
type: Concept
in scheme: Navneobjekttype
definition: Liten snø- eller isflate som vanligvis ikke smelter om sommeren.
broader: isOgPermafrost

Fornøyelsespark
type: Concept
in scheme: Navneobjekttype
definition: Store, regulerte anlegg.
broader: fritidsanlegg

Forretningsbygg
type: Concept
in scheme: Navneobjekttype
definition: Bygning for kontor-, salg- og servicevirksomhet.
broader: næring

Forsamlingshus/kulturhus
type: Concept
in scheme: Navneobjekttype
definition: Teater, kino, samfunnshus, grendehus o.l.
broader: kulturinstitusjoner

Forskningsstasjon
type: Concept
in scheme: Navneobjekttype
definition: Bemannet forskningsstasjon eller meteorologisk stasjon med bygningsmasse.
broader: institusjoner

Foss
type: Concept
in scheme: Navneobjekttype
definition: Vann i tilnærmet fritt fall.
broader: rennendeVann

Fritidsbolig
type: Concept
in scheme: Navneobjekttype
definition: Eget navn på hytter og hus som ikke er ment for fast bosetting.
broader: bolighus

Fylke
type: Concept
in scheme: Navneobjekttype
definition: Offisielt navn.
broader: administrativeIndelinger

Fyllplass
type: Concept
in scheme: Navneobjekttype
definition: Plass for deponering av masse som stein, jord og søppel.
broader: uttakOgDeponi

Fyrlykt
type: Concept
in scheme: Navneobjekttype
definition: Linse og lyskilde anbrakt i hus eller liknende. Ikke flytende.
broader: navigasjon

Fyrstasjon
type: Concept
in scheme: Navneobjekttype
definition: Automatisk og ubemannet. Et fast anlegg hvor linse og lyskilde er anbrakt i hus, tårn eller spesielt bygg. Ikke flytende.
broader: navigasjon

Gammel bosettingsplass
type: Concept
in scheme: Navneobjekttype
definition: Nedlagt bruk, seter, boplass hvor bygningen(e) er borte eller bare tuftene er tilbake.
broader: bolighus

Garasje/hangarbygg
type: Concept
in scheme: Navneobjekttype
definition: Trikkestall, bussgarasje, flyhangar eller lokomotivstall.
broader: samferdselsanlegg

Gard
type: Concept
in scheme: Navneobjekttype
definition: Felles navn for et helt gardsnummer (jf. § 8 i lov om stadnamn).
broader: gardsbebyggelse

Gass-/oljefelt i sjø
type: Concept
in scheme: Navneobjekttype
definition: Navngitt gass- eller oljefelt i havet.
broader: sjøbunn

Geologisk struktur
type: Concept
in scheme: Navneobjekttype
definition: Navngitt struktur/formasjon i berggrunnen.
broader: terrengdetaljer

Gjerde
type: Concept
in scheme: Navneobjekttype
definition: Oppsatt stengsel, vern, skille mellom jordstykker, eiendommer eller beiteområder.
broader: gardsbebyggelse

Gravplass
type: Concept
in scheme: Navneobjekttype
definition: Alle typer gravlunder, gravplasser.
broader: kulturinstitusjoner

Grend
type: Concept
in scheme: Navneobjekttype
definition: Mindre uregulert gards- og boligområde.
broader: bebyggelsesområder

Grensemerke
type: Concept
in scheme: Navneobjekttype
definition: Offisielt grensemerke: Varde, tre, stein, bolt, kors o.l.
broader: administrativeIndelinger

Grind
type: Concept
in scheme: Navneobjekttype
definition: Port i gjerde.
broader: veg

Grotte
type: Concept
in scheme: Navneobjekttype
definition: Naturlig fjellgrotte.
broader: terrengdetaljer

Grunne
type: Concept
in scheme: Navneobjekttype
definition: Lite område under vann som hever seg fra området rundt.
broader: grunnerIFerskvann

Grunne i sjø
type: Concept
in scheme: Navneobjekttype
definition: Markant forhøyning av havbunnen.
broader: grunnerISjø

Grunnkrets
type: Concept
in scheme: Navneobjekttype
definition: Offisielt navn på grunnkrets.
broader: administrativeIndelinger

Gruppe av tjern
type: Concept
in scheme: Navneobjekttype
definition: To eller flere små tjern.
broader: stilleståendeVann

Gruppe av vann
type: Concept
in scheme: Navneobjekttype
definition: To eller flere vann.
broader: stilleståendeVann

Grustak/steinbrudd
type: Concept
in scheme: Navneobjekttype
definition: Uttaksplass/-område for sand, grus, pukk, skifer eller stein.
broader: uttakOgDeponi

Grøft
type: Concept
in scheme: Navneobjekttype
definition: Rennende vann i oppgravd vannvei, f.eks. dreneringsgrøft i myr.
broader: rennendeVann

Halvøy
type: Concept
in scheme: Navneobjekttype
definition: Større nes i ferskvann med smalt eid mot fastland.
broader: ferskvannskontur

Halvøy i sjø
type: Concept
in scheme: Navneobjekttype
definition: Større nes med smalt eid mot fastland.
broader: kystkontur

Haug
type: Concept
in scheme: Navneobjekttype
definition: Liten, markant forhøynet terrengform.
broader: høyder

Havdyp
type: Concept
in scheme: Navneobjekttype
definition: Stort, dypt område i havet.
broader: sjøbunn

Havn
type: Concept
in scheme: Navneobjekttype
definition: Sted der fartøy laster, losser eller søker ly for vær og sjø.
broader: sjøfart

Havnehage
type: Concept
in scheme: Navneobjekttype
definition: Inngjerdet beitemark.
broader: dyrkamark

Havområde
type: Concept
in scheme: Navneobjekttype
definition: Del av et hav.
broader: farvann

Havstrøm
type: Concept
in scheme: Navneobjekttype
definition: Kontinuerlig bevegelse av vann (i havet) på grunn av klimatiske forhold eller tidevann.
broader: farvann

Hei
type: Concept
in scheme: Navneobjekttype
definition: Berglendt, høyere beliggende område med beitemark.
broader: høyder

Heller
type: Concept
in scheme: Navneobjekttype
definition: Utoverhengende bergvegg eller berghule.
broader: terrengdetaljer

Helseinstitusjon
type: Concept
in scheme: Navneobjekttype
definition: Aldershjem, rekreasjonshjem og lignende.
broader: institusjoner

Historisk bosetting
type: Concept
in scheme: Navneobjekttype
definition: Ubebodd eller forlatt bosetting med bestående bygningsmasse eller ruiner.
broader: bebyggelsesområder

Holdeplass
type: Concept
in scheme: Navneobjekttype
definition: Ubetjent stoppested for jernbane, tunnelbane og/eller trikk.
broader: bane

Holme
type: Concept
in scheme: Navneobjekttype
definition: Liten øy i ferskvann.
broader: ferskvannskontur

Holme i sjø
type: Concept
in scheme: Navneobjekttype
definition: Liten øy.
broader: kystkontur

Holmegruppe i sjø
type: Concept
in scheme: Navneobjekttype
definition: To eller flere små øyer.
broader: kystkontur

Hotell
type: Concept
in scheme: Navneobjekttype
definition: Større, offentlig godkjent overnattingssted.
broader: næring

Hylle
type: Concept
in scheme: Navneobjekttype
definition: Flatt, tilnærmet vannrett område i fjellside.
broader: terrengdetaljer

Hylle i sjø
type: Concept
in scheme: Navneobjekttype
definition: Undersjøisk benk; klippeavsats, kant, fremspring, avsats.
broader: sjøbunn

Hyttefelt
type: Concept
in scheme: Navneobjekttype
definition: Offentlig eller privat hyttefelt. Regulert område med høy utnyttelsesgrad.
broader: bebyggelsesområder

Høl
type: Concept
in scheme: Navneobjekttype
definition: Dyp elvebunn under foss eller etter et stryk.
broader: rennendeVann

Høyde
type: Concept
in scheme: Navneobjekttype
definition: Høyereliggende terrengform, mindre omfattende enn ås og større enn haug.
broader: høyder

Idrettsanlegg
type: Concept
in scheme: Navneobjekttype
definition: Alle typer utendørsanlegg for idrett.
broader: fritidsanlegg

Idrettshall
type: Concept
in scheme: Navneobjekttype
definition: Alle typer innendørsanlegg, f.eks. ishall, svømmehall, idrettshall og ridehall.
broader: fritidsanlegg

Industriområde
type: Concept
in scheme: Navneobjekttype
definition: Større, sammenhengende område til industri- og næringsformål.
broader: bebyggelsesområder

Innsjø
type: Concept
in scheme: Navneobjekttype
definition: Stort vann.
broader: stilleståendeVann

Isbre
type: Concept
in scheme: Navneobjekttype
definition: Større sammenhengende snø- eller isområde som ikke smelter i løpet av sommeren.
broader: isOgPermafrost

Iskuppel
type: Concept
in scheme: Navneobjekttype
definition: Konveks ismasse av en viss tykkelse i større bre eller innlandsis.
broader: isOgPermafrost

Jernstang
type: Concept
in scheme: Navneobjekttype
definition: Fast sjømerke av typen jernstang eller jernsøyle.
broader: navigasjon

Jorde
type: Concept
in scheme: Navneobjekttype
definition: Kultivert dyrkningsmark.
broader: dyrkamark

Juv
type: Concept
in scheme: Navneobjekttype
definition: Kløftlignende dal eller canyon.
broader: senkninger

Kabel
type: Concept
in scheme: Navneobjekttype
definition: Alle typer kabler i sjø eller i ferskvann.
broader: energi

Kai
type: Concept
in scheme: Navneobjekttype
definition: Større, fastbygd bryggeanlegg.
broader: sjøfart

Kanal
type: Concept
in scheme: Navneobjekttype
definition: Kunstig eller naturlig vannvei eller gjennomseiling.
broader: sjøfart

Kilde
type: Concept
in scheme: Navneobjekttype
definition: Oppkomme, olle, kildeutspring, osv.
broader: rennendeVann

Kirke
type: Concept
in scheme: Navneobjekttype
definition: Kirke, kapell, arbeidskirke o.l.
broader: kulturinstitusjoner

Klakk i sjø
type: Concept
in scheme: Navneobjekttype
definition: Fjellknatt på sjøbunnen.
broader: grunnerISjø

Klopp
type: Concept
in scheme: Navneobjekttype
definition: Liten gangbru av stokker og/eller stein over bekker og elver, i myr eller i fjæra.
broader: samferdselsanlegg

Kommune
type: Concept
in scheme: Navneobjekttype
definition: Offisielt navn.
broader: administrativeIndelinger

Kontinentalsokkel
type: Concept
in scheme: Navneobjekttype
definition: Område med grunt hav rundt kontinentene. Ofte brukt om et lands økonomiske interessesone til sjøs.
broader: sjøbunn

Korallrev
type: Concept
in scheme: Navneobjekttype
definition: Rev som er dannet av koraller.
broader: sjøbunn

Kraftgate (rørgate)
type: Concept
in scheme: Navneobjekttype
definition: Store tilførselsrør for kraftanlegg.
broader: energi

Kraftledning
type: Concept
in scheme: Navneobjekttype
definition: Stor strømoverføringsledning.
broader: energi

Kraftstasjon
type: Concept
in scheme: Navneobjekttype
definition: Alle typer / alle størrelser til energiproduksjon (f.eks. el. og varme).
broader: energi

Krater
type: Concept
in scheme: Navneobjekttype
definition: Skål- eller traktformet senkning i jordoverflaten forårsaket av vulkansk aktivitet eller av meteorittnedslag.
broader: senkninger

Landingsplass
type: Concept
in scheme: Navneobjekttype
definition: Landingsplass for privatfly.
broader: luftfart

Landskapsområde
type: Concept
in scheme: Navneobjekttype
definition: Område der drag i landskapet, naturforhold, arealbruk og bosetting er samlende og skiller seg fra tilgrensende områder.
broader: terrengområder

Lanterne
type: Concept
in scheme: Navneobjekttype
definition: En innretning hvor linsen med eller uten beskyttelsesglass utgjør en del av den bærende del av konstruksjonen. Ikke flytende.
broader: navigasjon

Li
type: Concept
in scheme: Navneobjekttype
definition: Skrånende terreng.
broader: skråninger

Lon
type: Concept
in scheme: Navneobjekttype
definition: Utbuktning i elv eller bekk der vannet renner stille.
broader: rennendeVann

Lysbøye
type: Concept
in scheme: Navneobjekttype
definition: Flytende innretning for farvannsmerking med en lanterne som lyskilde.
broader: navigasjon

Matrikkeladressenavn
type: Concept
in scheme: Navneobjekttype
definition: Et stedsnavn som inngår i den offiselle adressen ved matrikkeladresser, jf. § 55 tredje ledd i matrikkelforskriften.
broader: veg

Melkeplass
type: Concept
in scheme: Navneobjekttype
definition: Seterplass uten hus (ev. med enkelt skur) brukt til melking av husdyr.
broader: dyrkamark

Militært bygg/anlegg
type: Concept
in scheme: Navneobjekttype
definition: Militærleir.
broader: institusjoner

Mo
type: Concept
in scheme: Navneobjekttype
definition: Større, flatt landområde (ofte skogkledd).
broader: flater

Molo
type: Concept
in scheme: Navneobjekttype
definition: Fast byggverk, utstikkende voll i sjøen.
broader: sjøfart

Morenerygg i sjø
type: Concept
in scheme: Navneobjekttype
definition: Marin israndavsetning.
broader: sjøbunn

Museum/galleri/bibliotek
type: Concept
in scheme: Navneobjekttype
definition: Alle typer museum, galleri og bibliotek.
broader: kulturinstitusjoner

Myr
type: Concept
in scheme: Navneobjekttype
definition: Alle typer fra åpen gressmyr til våt moldjord dekket med kjerr.
broader: våtmark

Nasjon
type: Concept
in scheme: Navneobjekttype
definition: Offisielt navn på selvstendig stat eller land.
broader: administrativeIndelinger

Navnegard
type: Concept
in scheme: Navneobjekttype
definition: Opprinnelig navn fra før garden ble oppdelt i gards- og bruksenheter. Navnegardens utbredelse kan omfatte flere enn ett gardsnummer.
broader: gardsbebyggelse

Nes
type: Concept
in scheme: Navneobjekttype
definition: Landområde stikkende ut i ferskvann.
broader: ferskvannskontur

Nes i sjø
type: Concept
in scheme: Navneobjekttype
definition: Landområde stikkende ut i sjø.
broader: kystkontur

Nes ved elver
type: Concept
in scheme: Navneobjekttype
definition: Landet mellom to møtende elver.
broader: rennendeVann

Offersted
type: Concept
in scheme: Navneobjekttype
definition: Alle typer offersted.
broader: kulturminner

Oljeinstallasjon
type: Concept
in scheme: Navneobjekttype
definition: Stasjonær olje- og gassinstallasjon (fast eller flytende).
broader: energi

Oppdrettsanlegg
type: Concept
in scheme: Navneobjekttype
definition: Anlegg for foring og stell av husdyr til de kan settes i produksjon eller slaktes; oppforing av fisk (og andre sjødyr) i fangenskap.
broader: næring

Os
type: Concept
in scheme: Navneobjekttype
definition: Innløp eller utløp av elv eller bekk i innsjø/vann/tjern eller sjø (saltvann).
broader: rennendeVann

Overett
type: Concept
in scheme: Navneobjekttype
definition: To sjømerker, med eller uten lys, som, når de peiles på linje, viser kurs for gjennomseiling.
broader: navigasjon

Park
type: Concept
in scheme: Navneobjekttype
definition: Kultivert grøntområde i by/tettsted.
broader: fritidsanlegg

Parkeringsplass
type: Concept
in scheme: Navneobjekttype
definition: Tomt (eller bygning) for parkering av biler.
broader: veg

Pensjonat
type: Concept
in scheme: Navneobjekttype
definition: Mindre, offentlig godkjent overnattingssted.
broader: næring

Platå i sjø
type: Concept
in scheme: Navneobjekttype
definition: Stor, flat forhøyning som skiller seg fra havbunnen omkring.
broader: sjøbunn

Poststed
type: Concept
in scheme: Navneobjekttype
definition: Offisielt poststed/postnummerområde.
broader: administrativeIndelinger

Pytt
type: Concept
in scheme: Navneobjekttype
definition: Lite vannhull (mindre enn tjern).
broader: stilleståendeVann

Ras i sjø
type: Concept
in scheme: Navneobjekttype
definition: Undersjøisk rasområde med stein, jord, sand eller leire.
broader: sjøbunn

Rasteplass
type: Concept
in scheme: Navneobjekttype
definition: Rasteplass definert og lagt til rette av Statens vegvesen eller annen offentlig myndighet.
broader: samferdselsanlegg

Renne/Kløft i sjø
type: Concept
in scheme: Navneobjekttype
definition: Undersjøisk dal, kanal, senkning, ravine, fure, spor, rille o.l.
broader: sjøbunn

Rev i sjø
type: Concept
in scheme: Navneobjekttype
definition: Grunne, banke av stein/fjell (som strekker seg ut fra en kyst).
broader: sjøbunn

Rygg
type: Concept
in scheme: Navneobjekttype
definition: Langstrakt terrengform.
broader: høyder

Rygg i sjø
type: Concept
in scheme: Navneobjekttype
definition: Undersjøisk ås, åskam eller fjellrygg.
broader: sjøbunn

Rørledning
type: Concept
in scheme: Navneobjekttype
definition: Alle typer rørledninger: Olje, gass, vann o.l.
broader: energi

Rådhus
type: Concept
in scheme: Navneobjekttype
definition: Administrasjonssenteret i den administrative enheten, f.eks. stat, fylke, kommune.
broader: institusjoner

Sadel i sjø
type: Concept
in scheme: Navneobjekttype
definition: Undersjøisk skar mellom to høyere topper/rygger.
broader: sjøbunn

Sand
type: Concept
in scheme: Navneobjekttype
definition: Finkornede avsetninger (sand og/eller grus).
broader: løsmasseavsetninger

Senkning
type: Concept
in scheme: Navneobjekttype
definition: Flat forsenkning, dalsenkning.
broader: senkninger

Serveringssted
type: Concept
in scheme: Navneobjekttype
definition: Serveringssted uten overnatting.
broader: næring

Seter/støl
type: Concept
in scheme: Navneobjekttype
definition: Enklere landbruksbebyggelse med hus. Kan ha periodisk fast bosetting, vanligvis sommerstid.
broader: gardsbebyggelse

Setervoll
type: Concept
in scheme: Navneobjekttype
definition: Ryddet, gressbevokst område på seter uten hus.
broader: dyrkamark

Severdighet
type: Concept
in scheme: Navneobjekttype
definition: Minnesmerke, arkeologiske funn o.l.
broader: kulturminner

Sjødetalj
type: Concept
in scheme: Navneobjekttype
definition: Detalj som ikke dekkes av andre sjø-navneobjekttyper.
broader: detaljISjø

Sjømerke
type: Concept
in scheme: Navneobjekttype
definition: Varde av stein eller betong primært for navigering til sjøs.
broader: navigasjon

Sjøstykke
type: Concept
in scheme: Navneobjekttype
definition: Stykke av sjøen utanfor land, vanligvis innaskjærs eller i kystnære farvann.
broader: farvann

Skar
type: Concept
in scheme: Navneobjekttype
definition: Markant senkning i fjell eller berg.
broader: senkninger

Skiheis
type: Concept
in scheme: Navneobjekttype
definition: Skitrekk og stolheis i skianlegg.
broader: fritidsanlegg

Skjær
type: Concept
in scheme: Navneobjekttype
definition: Fjell eller stein i vannflaten.
broader: grunnerIFerskvann

Skjær i sjø
type: Concept
in scheme: Navneobjekttype
definition: Bergrunn nær eller rett over vannflaten.
broader: grunnerISjø

Skog
type: Concept
in scheme: Navneobjekttype
definition: Alle typer fra stor barskog til og med vierkratt i Finnmark.
broader: vegetasjon

Skogholt
type: Concept
in scheme: Navneobjekttype
definition: Mindre samling av trær.
broader: vegetasjon

Skogområde
type: Concept
in scheme: Navneobjekttype
definition: Større område med skog og mark.
broader: terrengområder

Skole
type: Concept
in scheme: Navneobjekttype
definition: Offentlig og privat skole.
broader: institusjoner

Skolekrets
type: Concept
in scheme: Navneobjekttype
definition: Skolekrets definert av kommunen.
broader: administrativeIndelinger

Skredområde
type: Concept
in scheme: Navneobjekttype
definition: Område der det går eller har gått skred.
broader: løsmasseavsetninger

Skytebane
type: Concept
in scheme: Navneobjekttype
definition: Bane for øvelse el. konkurranse i skyting.
broader: verne-OgBruksområder

Skytefelt
type: Concept
in scheme: Navneobjekttype
definition: Militært sprengingsfelt, bombe- og skytefelt, både på land og sjø.
broader: verne-OgBruksområder

Slette
type: Concept
in scheme: Navneobjekttype
definition: Åpent, flatt område.
broader: flater

Sluse
type: Concept
in scheme: Navneobjekttype
definition: Kunstig løfteanretning for båter i vassdrag.
broader: sjøfart

Småbåthavn
type: Concept
in scheme: Navneobjekttype
definition: Regulert havneanlegg for småbåter.
broader: sjøfart

Sokkel i sjø
type: Concept
in scheme: Navneobjekttype
definition: Undersjøisk fjellfot.
broader: sjøbunn

Sokn
type: Concept
in scheme: Navneobjekttype
definition: Kirkesokn i Den norske kirke.
broader: administrativeIndelinger

Soneinndeling til havs
type: Concept
in scheme: Navneobjekttype
definition: Fiskerisone, havrettssone og lignende.
broader: verne-OgBruksområder

Stake
type: Concept
in scheme: Navneobjekttype
definition: Flytende sjømerke. Ofte kalt bøyestake, stakebøye, kubbestake.
broader: navigasjon

Stasjon
type: Concept
in scheme: Navneobjekttype
definition: Stoppested for jernbane, tunnelbane og/eller trikk. Som regel betjent.
broader: bane

Statistisk tettsted
type: Concept
in scheme: Navneobjekttype
definition: Tettsted etter Statistisk sentralbyrås klassifisering som brukes for å lage statistikk over befolkning og tettsteder.
broader: administrativeIndelinger

Stein
type: Concept
in scheme: Navneobjekttype
definition: Frittliggende steinblokk.
broader: løsmasseavsetninger

Sti
type: Concept
in scheme: Navneobjekttype
definition: Stistrekning, råk, slepe (gammel drifteveg), reindriftsveg.
broader: veg

Strand
type: Concept
in scheme: Navneobjekttype
definition: Sand-, grus- eller steindekket område i vannkanten ved elv eller vann.
broader: ferskvannskontur

Strand i sjø
type: Concept
in scheme: Navneobjekttype
definition: Sand-, grus- eller steindekket område i sjøkanten.
broader: kystkontur

Stryk
type: Concept
in scheme: Navneobjekttype
definition: Del av elv, bekk der vannet går i stryk (og skiller seg tydelig fra resten av elva/bekken).
broader: rennendeVann

Stup
type: Concept
in scheme: Navneobjekttype
definition: Loddrett, svært bratt berg.
broader: terrengdetaljer

Stø
type: Concept
in scheme: Navneobjekttype
definition: Båtplass i vannkanten uten naust.
broader: sjøfart

Sund
type: Concept
in scheme: Navneobjekttype
definition: Innsnevret område i vann eller vassdrag.
broader: ferskvannskontur

Sund i sjø
type: Concept
in scheme: Navneobjekttype
definition: Innsnevret område mellom øyer eller fastland.
broader: kystkontur

Sykehus
type: Concept
in scheme: Navneobjekttype
definition: Offentlig og privat sykehus.
broader: institusjoner

Søkk
type: Concept
in scheme: Navneobjekttype
definition: Mindre markant, begrenset fordypning.
broader: senkninger

Søkk i sjø
type: Concept
in scheme: Navneobjekttype
definition: Stor eller liten grop på sjøbunnen.
broader: sjøbunn

Taubane
type: Concept
in scheme: Navneobjekttype
definition: Heis til frakt av gods/høy, ikke persontrafikk.
broader: samferdselsanlegg

Tettbebyggelse
type: Concept
in scheme: Navneobjekttype
definition: Bebygd område uten sentrumskarakter.
broader: bebyggelsesområder

Tettsted
type: Concept
in scheme: Navneobjekttype
definition: Mindre, bymessig bebygd område med sentrumskarakter.
broader: bebyggelsesområder

Tettsteddel
type: Concept
in scheme: Navneobjekttype
definition: Kulturmessig del av tettsted.
broader: bebyggelsesområder

Tjern
type: Concept
in scheme: Navneobjekttype
definition: Lite vann.
broader: stilleståendeVann

Topp
type: Concept
in scheme: Navneobjekttype
definition: Tind, markant topp på fjell, berg, ås osv.
broader: høyder

Torg
type: Concept
in scheme: Navneobjekttype
definition: Stor, åpen plass i en by.
broader: bebyggelsesområder

Torvtak
type: Concept
in scheme: Navneobjekttype
definition: Sted for uttak av myrtorv, brenntorv eller veksttorv.
broader: uttakOgDeponi

Traktorveg
type: Concept
in scheme: Navneobjekttype
definition: Driftsveg anlagt for traktorbruk. Ikke fremkommelig med vanlig personbil.
broader: veg

Tunnel
type: Concept
in scheme: Navneobjekttype
definition: Vanlig tunnel på veg. Bruk kurve/linje for tunnelstrekning eller punkt for navn på tunnelåpning.
broader: samferdselsanlegg

Turisthytte
type: Concept
in scheme: Navneobjekttype
definition: Overnattingssted utenfor tettbygd område.
broader: næring

TV-/radio- eller mobiltelefontårn
type: Concept
in scheme: Navneobjekttype
definition: Alle typer bakkebasert telekommunikasjon.
broader: kommunikasjon

Tømmervelte
type: Concept
in scheme: Navneobjekttype
definition: Midlertidig lagringsplass for tømmer.
broader: veg

Undersjøisk vegg
type: Concept
in scheme: Navneobjekttype
definition: Fjellside i havet.
broader: sjøbunn

Universitet/høgskole
type: Concept
in scheme: Navneobjekttype
definition: Offentlig og privat høgskole og universitet.
broader: institusjoner

Ur
type: Concept
in scheme: Navneobjekttype
definition: Steinområde, steinrøys eller steinur.
broader: løsmasseavsetninger

Utmark
type: Concept
in scheme: Navneobjekttype
definition: Beitemark i skog og mark vekk fra garden (og innmarka).
broader: dyrkamark

Utsiktspunkt
type: Concept
in scheme: Navneobjekttype
definition: Både fra tårn og på bakken.
broader: kulturminner

Utstikker
type: Concept
in scheme: Navneobjekttype
definition: Flytende bryggeanlegg.
broader: sjøfart

Vad
type: Concept
in scheme: Navneobjekttype
definition: Vadested, vanligvis der en stistrekning krysser elv, bekk eller vann.
broader: veg

Vaktstasjon/beredsskapsbygning
type: Concept
in scheme: Navneobjekttype
definition: Bygning for politi/brann/los/toll/ambulanse/fly- og skipsovervåkning.
broader: institusjoner

Valgkrets
type: Concept
in scheme: Navneobjekttype
definition: Valgkrets definert av kommunen.
broader: administrativeIndelinger

Vann
type: Concept
in scheme: Navneobjekttype
definition: Middels stort vann.
broader: stilleståendeVann

Varde
type: Concept
in scheme: Navneobjekttype
definition: (Som oftest) oppstablet stein som skal markere sti, grensemerke, trigonometrisk punkt o.l.
broader: navigasjon

Vegbom
type: Concept
in scheme: Navneobjekttype
definition: Mindre bomanlegg på privat veg.
broader: samferdselsanlegg

Vegkryss
type: Concept
in scheme: Navneobjekttype
definition: Allment kjent vegkryss i alle typer veger og gater.
broader: veg

Vegstrekning
type: Concept
in scheme: Navneobjekttype
definition: Navn på vegstrekning som ikke nødvendigvis har et formelt vedtak, og ikke er det samme som adressenavnet. Det kan være f.eks. turistrekninger og ringveger rundt en by.
broader: veg

Vegsving
type: Concept
in scheme: Navneobjekttype
definition: Allment kjent sving på alle typer veger og gater.
broader: veg

Verneområde
type: Concept
in scheme: Navneobjekttype
definition: Et område med spesiell natur- og/eller kulturverdi som er formelt vedtatt vernet etter offentlig regelverk. Alle typer, både på sjø og land.
broader: verne-OgBruksområder

Vidde
type: Concept
in scheme: Navneobjekttype
definition: Høyereliggende (fjell)område med lite høydevariasjoner innenfor området, som regel over tregrensa.
broader: terrengområder

Vik
type: Concept
in scheme: Navneobjekttype
definition: Kil eller bukt i vann eller vassdrag.
broader: ferskvannskontur

Vik i sjø
type: Concept
in scheme: Navneobjekttype
definition: Kil, bukt.
broader: kystkontur

Vulkan i sjø
type: Concept
in scheme: Navneobjekttype
definition: Vulkan eller slamvulkan på havbunnen.
broader: sjøbunn

Våg i sjø
type: Concept
in scheme: Navneobjekttype
definition: Fjordarm, større vik.
broader: kystkontur

Øy
type: Concept
in scheme: Navneobjekttype
definition: Tørt landområde i ferskvann atskilt fra fastlandet.
broader: ferskvannskontur

Øy i sjø
type: Concept
in scheme: Navneobjekttype
definition: Tørt landområde atskilt fra fastlandet.
broader: kystkontur

Øygruppe
type: Concept
in scheme: Navneobjekttype
definition: To eller flere øyer i ferskvann.
broader: ferskvannskontur

Øygruppe i sjø
type: Concept
in scheme: Navneobjekttype
definition: To eller flere øyer.
broader: kystkontur

Øyr
type: Concept
in scheme: Navneobjekttype
definition: Sand-/grusområde i elvemunning, elvedelta både mot innsjø/vann og saltvann.
broader: løsmasseavsetninger

Ås
type: Concept
in scheme: Navneobjekttype
definition: Langstrakt høydedrag.
broader: høyder

eiendomsteig
type: Concept
in scheme: Navneobjekttype
definition: Et stykke eiendom som ikke henger sammen med resten av eiendommen.

våtmarksområde
type: Concept
in scheme: Navneobjekttype
definition: Sump, område med våtmark.

busstasjon
type: Concept
in scheme: Navneobjekttype
definition: Større busstopp der flere busslinjer kobles, knutepunkt.

vannstandsmåler
type: Concept
in scheme: Navneobjekttype
definition: Innretning for å måle vann eller tidevannsnivå.

friluftsområde
type: Concept
in scheme: Navneobjekttype
definition: Et område som er avsatt for friluftsliv.

sjømerke med indirekte belysning
type: Concept
in scheme: Navneobjekttype
definition: Sjømerke med indirekte belyst struktur, skilt, fundament eller plasseringspunkt.

reinbeitedistrikt
type: Concept
in scheme: Navneobjekttype
definition: Reinbeitedistrikt.

boinstitusjon
type: Concept
in scheme: Navneobjekttype
definition: Dekker både tilrettelagte boliger og asyl-/flykningmottak.

egg
type: Concept
in scheme: Navneobjekttype
definition: Skarp fjellegg der det går bratt ned på begge sider.

fjellvegg
type: Concept
in scheme: Navneobjekttype
definition: Tilnærmet loddrett vegg i fjellside.

del av vann
type: Concept
in scheme: Navneobjekttype
definition: Mindre del av vann.

jernbanebru
type: Concept
in scheme: Navneobjekttype
definition: Bru for jernbane.

jernbanetunnel
type: Concept
in scheme: Navneobjekttype
definition: Tunnel for jernbane. Bruk kurve/linje for tunnelstrekning på jerbane eller punkt for navn på tunnelåpning/kort tunnel.

helikopterlandingsplass
type: Concept
in scheme: Navneobjekttype
definition: Landingsplass for helikopter.

kultur messehall
type: Concept
in scheme: Navneobjekttype
definition: Stort anlegg/hall til flerbruk - varemesse, konserter, idrettsarrangement.

overbygg
type: Concept
in scheme: Navneobjekttype
definition: Overbygg over veg eller jernbane for beskyttelse mot ras, for å gjemme f.eks. veg i bebyggelseområde eller som viltoverganger.

mindre brukonstruksjon
type: Concept
in scheme: Navneobjekttype
definition: Korte bruer eller kulverter hvor navnet er av liten allmenn interresse eller av teknisk art.

støls setereiendom
type: Concept
in scheme: Navneobjekttype
definition: Matrikulert seternavn eller enkeltseter innenfor et seterområde

tuft
type: Concept
in scheme: Navneobjekttype
definition: Sted som har hatt bebyggelse, men som antagelig ikke har vært bebodd. Ruin.

vannverk
type: Concept
in scheme: Navneobjekttype
definition: Inntak for drikkevann/vanningsvann.

hammar
type: Concept
in scheme: Navneobjekttype
definition: Utoverhengende berg.

fjellovergang
type: Concept
in scheme: Navneobjekttype
definition: Vegstrekning som krysser værutsatt fjellparti.

sva
type: Concept
in scheme: Navneobjekttype
definition: Bart, avrundet glatt fjell